Installation - linking Mingw-64 to Codelite

CodeLite installation/troubleshooting forum
grego101
CodeLite Curious
Posts: 1
Joined: Sun Jun 21, 2020 7:16 am
Genuine User: Yes
IDE Question: C++
Contact:

Installation - linking Mingw-64 to Codelite

Post by grego101 » Sun Jun 21, 2020 7:24 am

Codelite: 14.0.1
Downloaded and installed
Windows 10 Pro
MinGw-64 7.0

Hi,

I installed Mingw-64 7.0 compiler then Codelite version as above...created a new compiler and pointed it to the bin directory of the Mingw......I received the message that a new compiler was found. However when I compiled a simple c++ program I get the following error ( I am new to this IDE):

Code: Select all

C:\WINDOWS\system32\cmd.exe /C ""C:/Program Files/mingw-w64/x86_64-8.1.0-posix-seh-rt_v6-rev0/mingw64/bin/mingw32-make.exe" -e -f  Makefile"
"----------Building project:[ TestDocuments - Debug ]----------"
mingw32-make.exe[1]: Entering directory 'C:/Users/DELL/Documents/Documents/TestDocuments'
gcc -c  "C:/Users/DELL/Documents/Documents/TestDocuments/main.c" -g -O0 -Wall  -o ../build-Debug/TestDocuments/main.c -I. -I.
gcc -o ..\build-Debug\bin\TestDocuments @../build-Debug/TestDocuments/ObjectsList.txt -L.
../build-Debug/TestDocuments/main.c:1:2: error: stray '\206' in program
 d_      "        .text           0     _           P`.data                               @ P_.bss                                _ P_.rdata             L              @ P@.xdata             \              @ 0@.pdata             h  _         @ 0@/4              _  t  _         @ B/16             W                 @ B/30             0   f  _         @ B/45             t   _           @ B/57                                 @ B/68             @
  ^
../build-Debug/TestDocuments/main.c:2:1: warning: null character(s) ignored
               @ P@/79             @   J           @ @BUH__H__ _MH_U_    H_     _    _    H__ ]______hello world     2P      +       _       GNU C17 8.1.0 -mtune=core2 -march=nocona -g -O0 C:/Users/DELL/Documents/Documents/TestDocuments/main.c C:\Users\DELL\Documents\Documents\TestDocuments         +           char long long unsigned int long long int short unsigned int int long int _   unsigned int long unsigned int unsigned char main           +       __  argc   _ argv    :;9I   ,                     +                       p    M   _       C:/Users/DELL/Documents/Documents/TestDocuments  main.c              _Y _Y GCC: (x86_64-posix-seh-rev0, Built by MinGW-W64 project) 8.1.0     ____ x _      $               +       A_C f_            
 ^
../build-Debug/TestDocuments/main.c:2:6: warning: null character(s) preserved in literal
               @ P@/79             @   J           @ @BUH__H__ _MH_U_    H_     _    _    H__ ]______hello world     2P      +       _       GNU C17 8.1.0 -mtune=core2 -march=nocona -g -O0 C:/Users/DELL/Documents/Documents/TestDocuments/main.c C:\Users\DELL\Documents\Documents\TestDocuments         +           char long long unsigned int long long int short unsigned int int long int _   unsigned int long unsigned int unsigned char main           +       __  argc   _ argv    :;9I   ,                     +                       p    M   _       C:/Users/DELL/Documents/Documents/TestDocuments  main.c              _Y _Y GCC: (x86_64-posix-seh-rev0, Built by MinGW-W64 project) 8.1.0     ____ x _      $               +       A_C f_            
      ^
../build-Debug/TestDocuments/main.c:2:6: warning: missing terminating " character
../build-Debug/TestDocuments/main.c:2:6: error: missing terminating " character
               @ P@/79             @   J           @ @BUH__H__ _MH_U_    H_     _    _    H__ ]______hello world     2P      +       _       GNU C17 8.1.0 -mtune=core2 -march=nocona -g -O0 C:/Users/DELL/Documents/Documents/TestDocuments/main.c C:\Users\DELL\Documents\Documents\TestDocuments         +           char long long unsigned int long long int short unsigned int int long int _   unsigned int long unsigned int unsigned char main           +       __  argc   _ argv    :;9I   ,                     +                       p    M   _       C:/Users/DELL/Documents/Documents/TestDocuments  main.c              _Y _Y GCC: (x86_64-posix-seh-rev0, Built by MinGW-W64 project) 8.1.0     ____ x _      $               +       A_C f_            
      ^~~~~~~~~~~~~~~~~~~~~~~~~~~~~~~~~~~~~~~~~~~~~~~~~~~~~~~~~~~~~~~~~~~~~~~~~~~~~~~~~~~~~~~~~~~~~~~~~~~~~~~~~~~~~~~~~~~~~~~~~~~~~~~~~~~~~~~~~~~~~~~~~~~~~~~~~~~~~~~~~~~~~~~~~~~~~~~~~~~~~~~~~~~~~~~~~~~~~~~~~~~~~~~~~~~~~~~~~~~~~~~~~~~~~~~~~~~~~~~~~~~~~~~~~~~~~~~~~~~~~~~~~~~~~~~~~~~~~~~~~~~~~~~~~~~~~~~~~~~~~~~~~~~~~~~~~~~~~~~~~~~~~~~~~~~~~~~~~~~~~~~~~~~~~~~~~~~~~~~~~~~~~~~~~~~~~~~~~~~~~~~~~~~~~~~~~~~~~~~~~~~~~~~~~~~~~~~~~~~~~~~~~~~~~~~~~~~~~~~~~~~~~~~~~~~~~~~~~~~~~~~~~~~~~~~~
../build-Debug/TestDocuments/main.c:3:1: error: stray '\5' in program
                                         _       _       ]                    \       
 ^
../build-Debug/TestDocuments/main.c:3:2: warning: null character(s) ignored
                                         _       _       ]                    \       
  ^
../build-Debug/TestDocuments/main.c:3:16: error: stray '@' in program
                                         _       _       ]                    \       
                ^
../build-Debug/TestDocuments/main.c:3:17: warning: null character(s) ignored
                                         _       _       ]                    \       
                 ^
../build-Debug/TestDocuments/main.c:1:1: error: unknown type name 'd'
 d_      "        .text           0     _           P`.data                               @ P_.bss                                _ P_.rdata             L              @ P@.xdata             \              @ 0@.pdata             h  _         @ 0@/4              _  t  _         @ B/16             W                 @ B/30             0   f  _         @ B/45             t   _           @ B/57                                 @ B/68             @
 ^
../build-Debug/TestDocuments/main.c:3:19: error: stray '@' in program
                                         _       _       ]                    \       
                   ^
../build-Debug/TestDocuments/main.c:3:20: error: expected '=', ',', ';', 'asm' or '__attribute__' before '/' token
                                         _       _       ]                    \       
                    ^
../build-Debug/TestDocuments/main.c:3:23: warning: null character(s) ignored
                                         _       _       ]                    \       
                       ^
../build-Debug/TestDocuments/main.c:3:36: error: stray '@' in program
                                         _       _       ]                    \       
                                    ^
../build-Debug/TestDocuments/main.c:3:37: warning: null character(s) ignored
                                         _       _       ]                    \       
                                     ^
../build-Debug/TestDocuments/main.c:3:41: error: stray '\5' in program
                                         _       _       ]                    \       
                                         ^
../build-Debug/TestDocuments/main.c:3:42: warning: null character(s) ignored
                                         _       _       ]                    \       
                                          ^
../build-Debug/TestDocuments/main.c:3:44: error: stray '\16' in program
                                         _       _       ]                    \       
                                            ^
../build-Debug/TestDocuments/main.c:3:45: error: stray '\6' in program
                                         _       _       ]                    \       
                                             ^
../build-Debug/TestDocuments/main.c:3:46: warning: null character(s) ignored
                                         _       _       ]                    \       
                                              ^
../build-Debug/TestDocuments/main.c:3:52: error: stray '\2' in program
                                         _       _       ]                    \       
                                                    ^
../build-Debug/TestDocuments/main.c:3:53: warning: null character(s) ignored
                                         _       _       ]                    \       
                                                     ^
../build-Debug/TestDocuments/main.c:3:56: error: stray '@' in program
                                         _       _       ]                    \       
                                                        ^
../build-Debug/TestDocuments/main.c:3:57: warning: null character(s) ignored
                                         _       _       ]                    \       
                                                         ^
../build-Debug/TestDocuments/main.c:3:58: error: stray '@' in program
                                         _       _       ]                    \       
                                                          ^
../build-Debug/TestDocuments/main.c:3:62: error: stray '\211' in program
                                         _       _       ]                    \       
                                                              ^
../build-Debug/TestDocuments/main.c:3:63: error: stray '\345' in program
                                         _       _       ]                    \       
                                                               ^
../build-Debug/TestDocuments/main.c:3:65: error: stray '\203' in program
                                         _       _       ]                    \       
                                                                 ^
../build-Debug/TestDocuments/main.c:3:66: error: stray '\354' in program
                                         _       _       ]                    \       
                                                                  ^
../build-Debug/TestDocuments/main.c:3:68: error: stray '\211' in program
                                         _       _       ]                    \       
                                                                    ^
../build-Debug/TestDocuments/main.c:3:70: error: stray '\20' in program
                                         _       _       ]                    \       
                                                                      ^
../build-Debug/TestDocuments/main.c:3:72: error: stray '\211' in program
                                         _       _       ]                    \       
                                                                        ^
../build-Debug/TestDocuments/main.c:3:74: error: stray '\30' in program
                                         _       _       ]                    \       
                                                                          ^
../build-Debug/TestDocuments/main.c:3:75: error: stray '\350' in program
                                         _       _       ]                    \       
                                                                           ^
../build-Debug/TestDocuments/main.c:3:76: warning: null character(s) ignored
                                         _       _       ]                    \       
                                                                            ^
../build-Debug/TestDocuments/main.c:3:81: error: stray '\215' in program
                                         _       _       ]                    \       
                                                                                 ^
../build-Debug/TestDocuments/main.c:4:1: warning: null character(s) ignored
../build-Debug/TestDocuments/main.c:4:5: error: stray '\350' in program
../build-Debug/TestDocuments/main.c:4:6: warning: null character(s) ignored
../build-Debug/TestDocuments/main.c:4:10: error: stray '\270' in program
../build-Debug/TestDocuments/main.c:4:11: warning: null character(s) ignored
../build-Debug/TestDocuments/main.c:4:16: error: stray '\203' in program
../build-Debug/TestDocuments/main.c:4:17: error: stray '\304' in program
../build-Debug/TestDocuments/main.c:4:20: error: stray '\303' in program
../build-Debug/TestDocuments/main.c:4:21: error: stray '\220' in program
../build-Debug/TestDocuments/main.c:4:22: error: stray '\220' in program
../build-Debug/TestDocuments/main.c:4:23: error: stray '\220' in program
../build-Debug/TestDocuments/main.c:4:24: error: stray '\220' in program
../build-Debug/TestDocuments/main.c:4:25: error: stray '\220' in program
../build-Debug/TestDocuments/main.c:4:37: warning: null character(s) ignored
../build-Debug/TestDocuments/main.c:4:42: error: stray '\1' in program
../build-Debug/TestDocuments/main.c:4:43: error: stray '\10' in program
../build-Debug/TestDocuments/main.c:4:44: error: stray '\3' in program
../build-Debug/TestDocuments/main.c:4:45: error: stray '\5' in program
../build-Debug/TestDocuments/main.c:4:46: error: stray '\10' in program
../build-Debug/TestDocuments/main.c:4:48: error: stray '\4' in program
../build-Debug/TestDocuments/main.c:4:49: error: stray '\3' in program
../build-Debug/TestDocuments/main.c:4:50: error: stray '\1' in program
../build-Debug/TestDocuments/main.c:4:52: warning: null character(s) ignored
../build-Debug/TestDocuments/main.c:4:59: warning: null character(s) ignored
../build-Debug/TestDocuments/main.c:4:66: error: stray '\227' in program
../build-Debug/TestDocuments/main.c:4:67: error: stray '\1' in program
../build-Debug/TestDocuments/main.c:4:68: warning: null character(s) ignored
../build-Debug/TestDocuments/main.c:4:70: error: stray '\4' in program
../build-Debug/TestDocuments/main.c:4:71: warning: null character(s) ignored
../build-Debug/TestDocuments/main.c:4:76: error: stray '\10' in program
../build-Debug/TestDocuments/main.c:4:77: error: stray '\1' in program
../build-Debug/TestDocuments/main.c:4:86: error: too many decimal points in number
../build-Debug/TestDocuments/main.c:4:125: warning: null character(s) ignored
../build-Debug/TestDocuments/main.c:4:181: warning: null character(s) ignored
../build-Debug/TestDocuments/main.c:4:184: error: stray '\' in program
../build-Debug/TestDocuments/main.c:4:190: error: stray '\' in program
../build-Debug/TestDocuments/main.c:4:195: error: stray '\' in program
../build-Debug/TestDocuments/main.c:4:205: error: stray '\' in program
../build-Debug/TestDocuments/main.c:4:215: error: stray '\' in program
../build-Debug/TestDocuments/main.c:4:229: warning: null character(s) ignored
../build-Debug/TestDocuments/main.c:4:239: warning: null character(s) ignored
../build-Debug/TestDocuments/main.c:4:250: error: stray '\2' in program
../build-Debug/TestDocuments/main.c:4:251: error: stray '\1' in program
../build-Debug/TestDocuments/main.c:4:252: error: stray '\6' in program
../build-Debug/TestDocuments/main.c:4:257: warning: null character(s) ignored
../build-Debug/TestDocuments/main.c:4:258: error: stray '\2' in program
../build-Debug/TestDocuments/main.c:4:259: error: stray '\10' in program
../build-Debug/TestDocuments/main.c:4:260: error: stray '\7' in program
../build-Debug/TestDocuments/main.c:4:283: warning: null character(s) ignored
../build-Debug/TestDocuments/main.c:4:284: error: stray '\2' in program
../build-Debug/TestDocuments/main.c:4:285: error: stray '\10' in program
../build-Debug/TestDocuments/main.c:4:286: error: stray '\5' in program
../build-Debug/TestDocuments/main.c:4:300: warning: null character(s) ignored
../build-Debug/TestDocuments/main.c:4:301: error: stray '\2' in program
../build-Debug/TestDocuments/main.c:4:302: error: stray '\2' in program
../build-Debug/TestDocuments/main.c:4:303: error: stray '\7' in program
../build-Debug/TestDocuments/main.c:4:322: warning: null character(s) ignored
../build-Debug/TestDocuments/main.c:4:323: error: stray '\2' in program
../build-Debug/TestDocuments/main.c:4:324: error: stray '\4' in program
../build-Debug/TestDocuments/main.c:4:325: error: stray '\5' in program
../build-Debug/TestDocuments/main.c:4:329: warning: null character(s) ignored
../build-Debug/TestDocuments/main.c:4:330: error: stray '\2' in program
../build-Debug/TestDocuments/main.c:4:331: error: stray '\4' in program
../build-Debug/TestDocuments/main.c:4:332: error: stray '\5' in program
../build-Debug/TestDocuments/main.c:4:341: warning: null character(s) ignored
../build-Debug/TestDocuments/main.c:4:342: error: stray '\3' in program
../build-Debug/TestDocuments/main.c:4:343: error: stray '\10' in program
../build-Debug/TestDocuments/main.c:4:344: error: stray '\270' in program
../build-Debug/TestDocuments/main.c:4:345: warning: null character(s) ignored
../build-Debug/TestDocuments/main.c:4:348: error: stray '\2' in program
../build-Debug/TestDocuments/main.c:4:349: error: stray '\4' in program
../build-Debug/TestDocuments/main.c:4:350: error: stray '\7' in program
../build-Debug/TestDocuments/main.c:4:363: warning: null character(s) ignored
../build-Debug/TestDocuments/main.c:4:364: error: stray '\2' in program
../build-Debug/TestDocuments/main.c:4:365: error: stray '\4' in program
../build-Debug/TestDocuments/main.c:4:366: error: stray '\7' in program
../build-Debug/TestDocuments/main.c:4:384: warning: null character(s) ignored
../build-Debug/TestDocuments/main.c:4:385: error: stray '\2' in program
../build-Debug/TestDocuments/main.c:4:386: error: stray '\1' in program
../build-Debug/TestDocuments/main.c:4:387: error: stray '\10' in program
../build-Debug/TestDocuments/main.c:4:401: warning: null character(s) ignored
../build-Debug/TestDocuments/main.c:4:402: error: stray '\4' in program
../build-Debug/TestDocuments/main.c:4:407: warning: null character(s) ignored
../build-Debug/TestDocuments/main.c:4:408: error: stray '\1' in program
../build-Debug/TestDocuments/main.c:4:409: error: stray '\3' in program
../build-Debug/TestDocuments/main.c:4:410: error: stray '\5' in program
../build-Debug/TestDocuments/main.c:4:411: error: stray '\1' in program
../build-Debug/TestDocuments/main.c:4:412: error: stray '\1' in program
../build-Debug/TestDocuments/main.c:4:413: warning: null character(s) ignored
../build-Debug/TestDocuments/main.c:4:424: warning: null character(s) ignored
../build-Debug/TestDocuments/main.c:4:431: error: stray '\1' in program
../build-Debug/TestDocuments/main.c:4:432: error: stray '\234' in program
../build-Debug/TestDocuments/main.c:4:433: error: stray '\224' in program
../build-Debug/TestDocuments/main.c:4:434: error: stray '\1' in program
../build-Debug/TestDocuments/main.c:4:435: warning: null character(s) ignored
../build-Debug/TestDocuments/main.c:4:437: error: stray '\5' in program
../build-Debug/TestDocuments/main.c:4:442: warning: null character(s) ignored
../build-Debug/TestDocuments/main.c:4:443: error: stray '\1' in program
../build-Debug/TestDocuments/main.c:4:444: error: stray '\3' in program
../build-Debug/TestDocuments/main.c:4:445: error: stray '\16' in program
../build-Debug/TestDocuments/main.c:4:446: error: stray '\1' in program
../build-Debug/TestDocuments/main.c:4:447: error: stray '\1' in program
../build-Debug/TestDocuments/main.c:4:448: warning: null character(s) ignored
../build-Debug/TestDocuments/main.c:4:450: error: stray '\2' in program
../build-Debug/TestDocuments/main.c:4:451: error: stray '\221' in program
../build-Debug/TestDocuments/main.c:4:452: warning: null character(s) ignored
../build-Debug/TestDocuments/main.c:4:453: error: stray '\5' in program
../build-Debug/TestDocuments/main.c:4:458: warning: null character(s) ignored
../build-Debug/TestDocuments/main.c:4:459: error: stray '\1' in program
../build-Debug/TestDocuments/main.c:4:460: error: stray '\3' in program
../build-Debug/TestDocuments/main.c:4:461: error: stray '\33' in program
../build-Debug/TestDocuments/main.c:4:462: error: stray '\224' in program
../build-Debug/TestDocuments/main.c:4:463: error: stray '\1' in program
../build-Debug/TestDocuments/main.c:4:464: warning: null character(s) ignored
../build-Debug/TestDocuments/main.c:4:466: error: stray '\2' in program
../build-Debug/TestDocuments/main.c:4:467: error: stray '\221' in program
../build-Debug/TestDocuments/main.c:4:468: error: stray '\10' in program
../build-Debug/TestDocuments/main.c:4:469: warning: null character(s) ignored
../build-Debug/TestDocuments/main.c:4:470: error: stray '\3' in program
../build-Debug/TestDocuments/main.c:4:471: error: stray '\10' in program
../build-Debug/TestDocuments/main.c:4:472: error: stray '\24' in program
../build-Debug/TestDocuments/main.c:4:473: error: stray '\1' in program
../build-Debug/TestDocuments/main.c:4:474: warning: null character(s) ignored
../build-Debug/TestDocuments/main.c:4:477: error: stray '\1' in program
../build-Debug/TestDocuments/main.c:4:478: error: stray '\21' in program
../build-Debug/TestDocuments/main.c:4:479: error: stray '\1' in program
../build-Debug/TestDocuments/main.c:4:481: error: stray '\10' in program
../build-Debug/TestDocuments/main.c:4:482: error: stray '\23' in program
../build-Debug/TestDocuments/main.c:4:484: error: stray '\3' in program
../build-Debug/TestDocuments/main.c:4:485: error: stray '\10' in program
../build-Debug/TestDocuments/main.c:4:486: error: stray '\33' in program
../build-Debug/TestDocuments/main.c:4:487: error: stray '\10' in program
../build-Debug/TestDocuments/main.c:4:488: error: stray '\21' in program
../build-Debug/TestDocuments/main.c:4:489: error: stray '\1' in program
../build-Debug/TestDocuments/main.c:4:490: error: stray '\22' in program
../build-Debug/TestDocuments/main.c:4:491: error: stray '\7' in program
../build-Debug/TestDocuments/main.c:4:492: error: stray '\20' in program
../build-Debug/TestDocuments/main.c:4:493: error: stray '\27' in program
../build-Debug/TestDocuments/main.c:4:494: warning: null character(s) ignored
../build-Debug/TestDocuments/main.c:4:496: error: stray '\2' in program
../build-Debug/TestDocuments/main.c:4:498: warning: null character(s) ignored
../build-Debug/TestDocuments/main.c:4:503: error: stray '\3' in program
../build-Debug/TestDocuments/main.c:4:504: error: stray '\10' in program
../build-Debug/TestDocuments/main.c:4:505: warning: null character(s) ignored
../build-Debug/TestDocuments/main.c:4:507: error: stray '\3' in program
../build-Debug/TestDocuments/main.c:4:508: error: stray '\17' in program
../build-Debug/TestDocuments/main.c:4:509: warning: null character(s) ignored
../build-Debug/TestDocuments/main.c:4:513: error: stray '\23' in program
../build-Debug/TestDocuments/main.c:4:514: warning: null character(s) ignored
../build-Debug/TestDocuments/main.c:4:516: error: stray '\4' in program
../build-Debug/TestDocuments/main.c:4:518: error: stray '\1' in program
../build-Debug/TestDocuments/main.c:4:520: error: stray '\31' in program
../build-Debug/TestDocuments/main.c:4:521: error: stray '\3' in program
../build-Debug/TestDocuments/main.c:4:522: error: stray '\10' in program
../build-Debug/TestDocuments/main.c:4:527: error: expected identifier or '(' before numeric constant
../build-Debug/TestDocuments/main.c:4:529: warning: null character(s) preserved in literal
../build-Debug/TestDocuments/main.c:4:529: warning: missing terminating ' character
../build-Debug/TestDocuments/main.c:4:529: error: missing terminating ' character
../build-Debug/TestDocuments/main.c:5:1: warning: null character(s) ignored
../build-Debug/TestDocuments/main.c:5:2: error: stray '\1' in program
../build-Debug/TestDocuments/main.c:5:3: error: stray '\1' in program
../build-Debug/TestDocuments/main.c:5:4: error: stray '\1' in program
../build-Debug/TestDocuments/main.c:5:5: error: stray '\1' in program
../build-Debug/TestDocuments/main.c:5:6: warning: null character(s) ignored
../build-Debug/TestDocuments/main.c:5:9: error: stray '\1' in program
../build-Debug/TestDocuments/main.c:5:10: warning: null character(s) ignored
../build-Debug/TestDocuments/main.c:5:12: error: stray '\1' in program
../build-Debug/TestDocuments/main.c:5:60: warning: null character(s) ignored
../build-Debug/TestDocuments/main.c:5:68: warning: null character(s) ignored
../build-Debug/TestDocuments/main.c:5:69: error: stray '\1' in program
../build-Debug/TestDocuments/main.c:5:70: warning: null character(s) ignored
../build-Debug/TestDocuments/main.c:5:73: error: stray '\5' in program
../build-Debug/TestDocuments/main.c:5:74: error: stray '\1' in program
../build-Debug/TestDocuments/main.c:5:75: warning: null character(s) ignored
../build-Debug/TestDocuments/main.c:5:77: error: stray '\2' in program
../build-Debug/TestDocuments/main.c:5:78: warning: null character(s) ignored
../build-Debug/TestDocuments/main.c:5:86: error: stray '\25' in program
../build-Debug/TestDocuments/main.c:5:87: error: stray '\344' in program
../build-Debug/TestDocuments/main.c:5:88: error: stray '\5' in program
../build-Debug/TestDocuments/main.c:5:89: error: stray '\2' in program
../build-Debug/TestDocuments/main.c:5:91: error: stray '\5' in program
../build-Debug/TestDocuments/main.c:5:93: error: stray '\273' in program
../build-Debug/TestDocuments/main.c:5:94: error: stray '\5' in program
../build-Debug/TestDocuments/main.c:5:95: error: stray '\1' in program
../build-Debug/TestDocuments/main.c:5:97: error: stray '\2' in program
../build-Debug/TestDocuments/main.c:5:98: error: stray '\6' in program
../build-Debug/TestDocuments/main.c:5:99: warning: null character(s) ignored
../build-Debug/TestDocuments/main.c:5:100: error: stray '\1' in program
../build-Debug/TestDocuments/main.c:5:101: error: stray '\1' in program
../build-Debug/TestDocuments/main.c:5:159: error: too many decimal points in number
../build-Debug/TestDocuments/main.c:5:164: warning: null character(s) ignored
../build-Debug/TestDocuments/main.c:5:166: error: stray '\24' in program
../build-Debug/TestDocuments/main.c:5:167: warning: null character(s) ignored
../build-Debug/TestDocuments/main.c:5:170: error: stray '\377' in program
../build-Debug/TestDocuments/main.c:5:171: error: stray '\377' in program
../build-Debug/TestDocuments/main.c:5:172: error: stray '\377' in program
../build-Debug/TestDocuments/main.c:5:173: error: stray '\377' in program
../build-Debug/TestDocuments/main.c:5:174: error: stray '\1' in program
../build-Debug/TestDocuments/main.c:5:175: warning: null character(s) ignored
../build-Debug/TestDocuments/main.c:5:176: error: stray '\1' in program
../build-Debug/TestDocuments/main.c:5:180: error: stray '\7' in program
../build-Debug/TestDocuments/main.c:5:181: error: stray '\10' in program
../build-Debug/TestDocuments/main.c:5:182: error: stray '\240' in program
../build-Debug/TestDocuments/main.c:5:183: error: stray '\1' in program
../build-Debug/TestDocuments/main.c:5:184: warning: null character(s) ignored
../build-Debug/TestDocuments/main.c:5:191: warning: null character(s) ignored
../build-Debug/TestDocuments/main.c:5:207: warning: null character(s) ignored
../build-Debug/TestDocuments/main.c:5:215: error: stray '\16' in program
../build-Debug/TestDocuments/main.c:5:216: error: stray '\20' in program
../build-Debug/TestDocuments/main.c:5:217: error: stray '\206' in program
../build-Debug/TestDocuments/main.c:5:218: error: stray '\2' in program
../build-Debug/TestDocuments/main.c:6:1: error: stray '\6' in program
../build-Debug/TestDocuments/main.c:6:3: error: stray '\306' in program
../build-Debug/TestDocuments/main.c:6:5: error: stray '\7' in program
../build-Debug/TestDocuments/main.c:6:6: error: stray '\10' in program
../build-Debug/TestDocuments/main.c:6:7: warning: null character(s) ignored
../build-Debug/TestDocuments/main.c:6:12: error: stray '\20' in program
../build-Debug/TestDocuments/main.c:6:13: warning: null character(s) ignored
../build-Debug/TestDocuments/main.c:6:16: error: stray '\34' in program
../build-Debug/TestDocuments/main.c:6:17: warning: null character(s) ignored
../build-Debug/TestDocuments/main.c:6:20: error: stray '\4' in program
../build-Debug/TestDocuments/main.c:6:21: warning: null character(s) ignored
../build-Debug/TestDocuments/main.c:6:22: error: stray '\27' in program
../build-Debug/TestDocuments/main.c:6:23: warning: null character(s) ignored
../build-Debug/TestDocuments/main.c:7:1: warning: null character(s) ignored
../build-Debug/TestDocuments/main.c:7:4: error: stray '\4' in program
../build-Debug/TestDocuments/main.c:7:5: warning: null character(s) ignored
../build-Debug/TestDocuments/main.c:7:6: error: stray '\34' in program
../build-Debug/TestDocuments/main.c:7:7: warning: null character(s) ignored
../build-Debug/TestDocuments/main.c:7:10: error: stray '\35' in program
../build-Debug/TestDocuments/main.c:7:11: warning: null character(s) ignored
../build-Debug/TestDocuments/main.c:7:14: error: stray '\4' in program
../build-Debug/TestDocuments/main.c:7:15: warning: null character(s) ignored
../build-Debug/TestDocuments/main.c:7:20: error: stray '\4' in program
../build-Debug/TestDocuments/main.c:7:21: warning: null character(s) ignored
../build-Debug/TestDocuments/main.c:7:24: error: stray '\3' in program
../build-Debug/TestDocuments/main.c:7:25: warning: null character(s) ignored
../build-Debug/TestDocuments/main.c:7:26: error: stray '\4' in program
../build-Debug/TestDocuments/main.c:7:27: warning: null character(s) ignored
../build-Debug/TestDocuments/main.c:7:30: error: stray '\4' in program
../build-Debug/TestDocuments/main.c:7:31: warning: null character(s) ignored
../build-Debug/TestDocuments/main.c:7:34: error: stray '\3' in program
../build-Debug/TestDocuments/main.c:7:35: warning: null character(s) ignored
../build-Debug/TestDocuments/main.c:7:36: error: stray '\10' in program
../build-Debug/TestDocuments/main.c:7:37: warning: null character(s) ignored
../build-Debug/TestDocuments/main.c:7:44: error: stray '\3' in program
../build-Debug/TestDocuments/main.c:7:45: warning: null character(s) ignored
../build-Debug/TestDocuments/main.c:7:46: error: stray '\6' in program
../build-Debug/TestDocuments/main.c:7:47: warning: null character(s) ignored
../build-Debug/TestDocuments/main.c:7:50: error: stray '\22' in program
../build-Debug/TestDocuments/main.c:7:51: warning: null character(s) ignored
../build-Debug/TestDocuments/main.c:7:56: error: stray '\244' in program
../build-Debug/TestDocuments/main.c:7:57: warning: null character(s) ignored
../build-Debug/TestDocuments/main.c:7:60: error: stray '\4' in program
../build-Debug/TestDocuments/main.c:7:61: warning: null character(s) ignored
../build-Debug/TestDocuments/main.c:7:64: error: stray '\1' in program
../build-Debug/TestDocuments/main.c:7:65: warning: null character(s) ignored
../build-Debug/TestDocuments/main.c:7:66: error: stray '\264' in program
../build-Debug/TestDocuments/main.c:7:67: warning: null character(s) ignored
../build-Debug/TestDocuments/main.c:7:70: error: stray '\26' in program
../build-Debug/TestDocuments/main.c:7:71: warning: null character(s) ignored
../build-Debug/TestDocuments/main.c:7:77: error: stray '\1' in program
../build-Debug/TestDocuments/main.c:7:78: warning: null character(s) ignored
../build-Debug/TestDocuments/main.c:7:80: error: stray '\4' in program
../build-Debug/TestDocuments/main.c:7:81: warning: null character(s) ignored
../build-Debug/TestDocuments/main.c:7:84: error: stray '\1' in program
../build-Debug/TestDocuments/main.c:7:85: warning: null character(s) ignored
../build-Debug/TestDocuments/main.c:7:86: error: stray '\6' in program
../build-Debug/TestDocuments/main.c:7:87: warning: null character(s) ignored
../build-Debug/TestDocuments/main.c:7:90: error: stray '\20' in program
../build-Debug/TestDocuments/main.c:7:91: warning: null character(s) ignored
../build-Debug/TestDocuments/main.c:7:96: error: stray '\20' in program
../build-Debug/TestDocuments/main.c:7:97: warning: null character(s) ignored
../build-Debug/TestDocuments/main.c:7:100: error: stray '\4' in program
../build-Debug/TestDocuments/main.c:7:101: warning: null character(s) ignored
../build-Debug/TestDocuments/main.c:7:104: error: stray '\1' in program
../build-Debug/TestDocuments/main.c:7:105: warning: null character(s) ignored
../build-Debug/TestDocuments/main.c:7:106: error: stray '\' in program
../build-Debug/TestDocuments/main.c:7:107: warning: null character(s) ignored
../build-Debug/TestDocuments/main.c:7:110: error: stray '\4' in program
../build-Debug/TestDocuments/main.c:7:111: warning: null character(s) ignored
../build-Debug/TestDocuments/main.c:7:114: error: stray '\1' in program
../build-Debug/TestDocuments/main.c:7:115: warning: null character(s) ignored
../build-Debug/TestDocuments/main.c:7:116: error: stray '\34' in program
../build-Debug/TestDocuments/main.c:7:117: warning: null character(s) ignored
../build-Debug/TestDocuments/main.c:7:120: error: stray '\32' in program
../build-Debug/TestDocuments/main.c:7:121: warning: null character(s) ignored
../build-Debug/TestDocuments/main.c:7:130: error: stray '\4' in program
../build-Debug/TestDocuments/main.c:7:131: warning: null character(s) ignored
../build-Debug/TestDocuments/main.c:7:134: error: stray '\1' in program
../build-Debug/TestDocuments/main.c:7:135: warning: null character(s) ignored
../build-Debug/TestDocuments/main.c:7:141: warning: null character(s) ignored
../build-Debug/TestDocuments/main.c:7:148: error: stray '\376' in program
../build-Debug/TestDocuments/main.c:7:149: error: stray '\377' in program
../build-Debug/TestDocuments/main.c:7:150: warning: null character(s) ignored
../build-Debug/TestDocuments/main.c:7:153: error: stray '\1' in program
../build-Debug/TestDocuments/main.c:7:160: warning: null character(s) ignored
../build-Debug/TestDocuments/main.c:7:176: warning: null character(s) ignored
../build-Debug/TestDocuments/main.c:7:184: error: stray '\1' in program
../build-Debug/TestDocuments/main.c:7:185: warning: null character(s) ignored
../build-Debug/TestDocuments/main.c:7:188: error: stray '\2' in program
../build-Debug/TestDocuments/main.c:7:189: error: stray '\1' in program
../build-Debug/TestDocuments/main.c:7:190: warning: null character(s) ignored
../build-Debug/TestDocuments/main.c:7:213: warning: null character(s) ignored
../build-Debug/TestDocuments/main.c:7:220: error: stray '\1' in program
../build-Debug/TestDocuments/main.c:7:221: warning: null character(s) ignored
../build-Debug/TestDocuments/main.c:7:224: error: stray '\3' in program
../build-Debug/TestDocuments/main.c:7:225: error: stray '\1' in program
../build-Debug/TestDocuments/main.c:7:227: warning: null character(s) ignored
../build-Debug/TestDocuments/main.c:7:230: error: stray '\3' in program
../build-Debug/TestDocuments/main.c:7:231: warning: null character(s) ignored
../build-Debug/TestDocuments/main.c:7:249: warning: null character(s) ignored
../build-Debug/TestDocuments/main.c:7:256: error: stray '\2' in program
../build-Debug/TestDocuments/main.c:7:257: warning: null character(s) ignored
../build-Debug/TestDocuments/main.c:7:260: error: stray '\3' in program
../build-Debug/TestDocuments/main.c:7:261: error: stray '\1' in program
../build-Debug/TestDocuments/main.c:7:262: warning: null character(s) ignored
../build-Debug/TestDocuments/main.c:7:284: warning: null character(s) ignored
../build-Debug/TestDocuments/main.c:7:292: error: stray '\3' in program
../build-Debug/TestDocuments/main.c:7:293: warning: null character(s) ignored
../build-Debug/TestDocuments/main.c:7:296: error: stray '\3' in program
../build-Debug/TestDocuments/main.c:7:297: error: stray '\1' in program
../build-Debug/TestDocuments/main.c:7:298: warning: null character(s) ignored
../build-Debug/TestDocuments/main.c:7:322: warning: null character(s) ignored
../build-Debug/TestDocuments/main.c:7:328: error: stray '\4' in program
../build-Debug/TestDocuments/main.c:7:329: warning: null character(s) ignored
../build-Debug/TestDocuments/main.c:7:332: error: stray '\3' in program
../build-Debug/TestDocuments/main.c:7:333: error: stray '\1' in program
../build-Debug/TestDocuments/main.c:7:334: warning: null character(s) ignored
../build-Debug/TestDocuments/main.c:7:358: warning: null character(s) ignored
../build-Debug/TestDocuments/main.c:7:364: error: stray '\5' in program
../build-Debug/TestDocuments/main.c:7:365: warning: null character(s) ignored
../build-Debug/TestDocuments/main.c:7:368: error: stray '\3' in program
../build-Debug/TestDocuments/main.c:7:369: error: stray '\1' in program
../build-Debug/TestDocuments/main.c:7:370: warning: null character(s) ignored
../build-Debug/TestDocuments/main.c:7:394: warning: null character(s) ignored
../build-Debug/TestDocuments/main.c:7:400: error: stray '\6' in program
../build-Debug/TestDocuments/main.c:7:401: warning: null character(s) ignored
../build-Debug/TestDocuments/main.c:7:404: error: stray '\3' in program
../build-Debug/TestDocuments/main.c:7:405: error: stray '\1' in program
../build-Debug/TestDocuments/main.c:7:406: warning: null character(s) ignored
../build-Debug/TestDocuments/main.c:7:410: error: stray '\3' in program
../build-Debug/TestDocuments/main.c:7:411: warning: null character(s) ignored
../build-Debug/TestDocuments/main.c:7:428: error: stray '\' in program
../build-Debug/TestDocuments/main.c:7:429: warning: null character(s) ignored
../build-Debug/TestDocuments/main.c:7:436: error: stray '\7' in program
../build-Debug/TestDocuments/main.c:7:437: warning: null character(s) ignored
../build-Debug/TestDocuments/main.c:7:440: error: stray '\3' in program
../build-Debug/TestDocuments/main.c:7:441: error: stray '\1' in program
../build-Debug/TestDocuments/main.c:7:442: error: stray '\233' in program
../build-Debug/TestDocuments/main.c:7:443: error: stray '\1' in program
../build-Debug/TestDocuments/main.c:7:444: warning: null character(s) ignored
../build-Debug/TestDocuments/main.c:7:446: error: stray '\4' in program
../build-Debug/TestDocuments/main.c:7:447: warning: null character(s) ignored
../build-Debug/TestDocuments/main.c:7:465: warning: null character(s) ignored
../build-Debug/TestDocuments/main.c:7:472: error: stray '\10' in program
../build-Debug/TestDocuments/main.c:7:473: warning: null character(s) ignored
../build-Debug/TestDocuments/main.c:7:476: error: stray '\3' in program
../build-Debug/TestDocuments/main.c:7:477: error: stray '\1' in program
../build-Debug/TestDocuments/main.c:7:479: warning: null character(s) ignored
../build-Debug/TestDocuments/main.c:7:501: warning: null character(s) ignored
../build-Debug/TestDocuments/main.c:7:512: error: stray '\3' in program
../build-Debug/TestDocuments/main.c:7:513: error: stray '\1' in program
../build-Debug/TestDocuments/main.c:7:515: warning: null character(s) ignored
../build-Debug/TestDocuments/main.c:7:518: error: stray '\2' in program
../build-Debug/TestDocuments/main.c:7:519: warning: null character(s) ignored
../build-Debug/TestDocuments/main.c:7:536: error: stray '\205' in program
../build-Debug/TestDocuments/main.c:7:537: warning: null character(s) ignored
../build-Debug/TestDocuments/main.c:8:1: warning: null character(s) ignored
../build-Debug/TestDocuments/main.c:8:4: error: stray '\3' in program
../build-Debug/TestDocuments/main.c:8:5: error: stray '\1' in program
../build-Debug/TestDocuments/main.c:8:7: warning: null character(s) ignored
../build-Debug/TestDocuments/main.c:8:10: error: stray '\1' in program
../build-Debug/TestDocuments/main.c:8:11: warning: null character(s) ignored
../build-Debug/TestDocuments/main.c:8:28: error: stray '\221' in program
../build-Debug/TestDocuments/main.c:8:29: warning: null character(s) ignored
../build-Debug/TestDocuments/main.c:8:40: error: stray '\3' in program
../build-Debug/TestDocuments/main.c:8:41: error: stray '\1' in program
../build-Debug/TestDocuments/main.c:8:43: warning: null character(s) ignored
../build-Debug/TestDocuments/main.c:8:64: error: stray '\234' in program
../build-Debug/TestDocuments/main.c:8:65: warning: null character(s) ignored
../build-Debug/TestDocuments/main.c:9:1: warning: null character(s) ignored
../build-Debug/TestDocuments/main.c:9:4: error: stray '\3' in program
../build-Debug/TestDocuments/main.c:9:5: error: stray '\1' in program
../build-Debug/TestDocuments/main.c:9:6: error: stray '@' in program
../build-Debug/TestDocuments/main.c:9:7: warning: null character(s) ignored
../build-Debug/TestDocuments/main.c:9:10: error: stray '\2' in program
../build-Debug/TestDocuments/main.c:9:11: warning: null character(s) ignored
../build-Debug/TestDocuments/main.c:9:30: warning: null character(s) ignored
../build-Debug/TestDocuments/main.c:9:40: error: stray '\2' in program
../build-Debug/TestDocuments/main.c:9:41: warning: null character(s) ignored
../build-Debug/TestDocuments/main.c:9:46: warning: null character(s) ignored
../build-Debug/TestDocuments/main.c:9:58: error: stray '\2' in program
../build-Debug/TestDocuments/main.c:9:59: warning: null character(s) ignored
../build-Debug/TestDocuments/main.c:9:60: error: stray '\251' in program
../build-Debug/TestDocuments/main.c:9:61: warning: null character(s) ignored
../build-Debug/TestDocuments/main.c:9:75: warning: null character(s) ignored
../build-Debug/TestDocuments/main.c:9:89: warning: null character(s) ignored
../build-Debug/TestDocuments/main.c:9:104: warning: null character(s) ignored
../build-Debug/TestDocuments/main.c:9:116: warning: null character(s) ignored
../build-Debug/TestDocuments/main.c:9:127: warning: null character(s) ignored
../build-Debug/TestDocuments/main.c:9:138: warning: null character(s) ignored
../build-Debug/TestDocuments/main.c:9:151: warning: null character(s) ignored
../build-Debug/TestDocuments/main.c:9:163: warning: null character(s) ignored
../build-Debug/TestDocuments/main.c:9:177: warning: null character(s) ignored
../build-Debug/TestDocuments/main.c:9:192: warning: null character(s) ignored
../build-Debug/TestDocuments/main.c:9:204: warning: null character(s) ignored
../build-Debug/TestDocuments/main.c:9:215: warning: null character(s) ignored
../build-Debug/TestDocuments/main.c:9:228: warning: null character(s) ignored
mingw32-make.exe[1]: *** [TestDocuments.mk:80: ..\build-Debug\bin\TestDocuments] Error 1
mingw32-make.exe[1]: Leaving directory 'C:/Users/DELL/Documents/Documents/TestDocuments'
mingw32-make.exe: *** [Makefile:5: All] Error 2
====284 errors, 170 warnings====
Last edited by DavidGH on Sun Jun 21, 2020 10:45 am, edited 1 time in total.
Reason: Added code-tags

User avatar
eranif
CodeLite Plugin
Posts: 6110
Joined: Wed Feb 06, 2008 9:29 pm
Genuine User: Yes
IDE Question: C++
Contact:

Re: Installation - linking Mingw-64 to Codelite

Post by eranif » Mon Jun 29, 2020 12:36 pm

Check your source file main.c -> see if there are any 'stray' characters there
Make sure you have read the HOW TO POST thread

Post Reply